Searched defs:FAILED (Results 1 - 25 of 64) sorted by relevance

123

/external/chromium_org/chrome/browser/chromeos/file_system_provider/fileapi/
H A Dfile_stream_writer.h43 enum State { NOT_INITIALIZED, INITIALIZING, INITIALIZED, FAILED }; enumerator in enum:chromeos::file_system_provider::FileStreamWriter::State
H A Dfile_stream_reader.h53 enum State { NOT_INITIALIZED, INITIALIZING, INITIALIZED, FAILED }; enumerator in enum:chromeos::file_system_provider::FileStreamReader::State
/external/llvm/tools/msbuild/
H A Dinstall.bat36 goto FAILED
41 IF NOT %ERRORLEVEL% == 0 GOTO FAILED
43 IF NOT %ERRORLEVEL% == 0 GOTO FAILED
45 IF NOT %ERRORLEVEL% == 0 GOTO FAILED
51 IF NOT %ERRORLEVEL% == 0 GOTO FAILED
53 IF NOT %ERRORLEVEL% == 0 GOTO FAILED
55 IF NOT %ERRORLEVEL% == 0 GOTO FAILED
57 IF NOT %ERRORLEVEL% == 0 GOTO FAILED
59 IF NOT %ERRORLEVEL% == 0 GOTO FAILED
61 IF NOT %ERRORLEVEL% == 0 GOTO FAILED
86 :FAILED label
[all...]
/external/chromium_org/chrome/browser/ui/webui/help/
H A Dversion_updater.h22 FAILED, enumerator in enum:VersionUpdater::Status
/external/chromium_org/components/nacl/renderer/
H A Dfile_downloader.h27 FAILED enumerator in enum:nacl::FileDownloader::Status
/external/chromium_org/net/url_request/
H A Durl_request_status.h29 FAILED, enumerator in enum:net::URLRequestStatus::Status
/external/chromium_org/printing/
H A Dprinting_context.h45 FAILED, enumerator in enum:printing::PrintingContext::Result
/external/chromium_org/remoting/protocol/
H A Dsession.h51 FAILED, enumerator in enum:remoting::protocol::Session::State
61 // or CLOSED or FAILED.
107 // destroyed, unless the state is set to FAILED or CLOSED.
H A Dconnection_to_host.h62 FAILED, enumerator in enum:remoting::protocol::ConnectionToHost::State
/external/guava/guava/src/com/google/common/base/
H A DAbstractIterator.java37 READY, NOT_READY, DONE, FAILED, enum constant in enum:AbstractIterator.State
51 checkState(state != State.FAILED);
63 state = State.FAILED; // temporary pessimism
/external/guava/guava/src/com/google/common/collect/
H A DAbstractIterator.java81 FAILED, enum constant in enum:AbstractIterator.State
130 checkState(state != State.FAILED);
142 state = State.FAILED; // temporary pessimism
/external/guava/guava/src/com/google/common/util/concurrent/
H A DService.java37 * {@link State#FAILED}, and its behavior is undefined. Such a service cannot be
62 * State#FAILED}. If it has already finished starting, {@link
157 FAILED enum constant in enum:Service.State
/external/chromium_org/chrome/browser/chromeos/app_mode/
H A Dkiosk_external_updater.h44 FAILED, enumerator in enum:chromeos::KioskExternalUpdater::ExternalUpdateStatus
/external/chromium_org/chrome/browser/chromeos/login/
H A Deula_browsertest.cc87 net::URLRequestStatus::FAILED); member in class:__anon3283::net::URLRequestStatus
/external/chromium_org/components/translate/core/browser/
H A Dtranslate_url_fetcher.h27 FAILED, // The last fetch request was finished with a failure. enumerator in enum:translate::TranslateURLFetcher::State
/external/chromium_org/third_party/libjingle/source/talk/app/webrtc/java/src/org/webrtc/
H A DMediaStreamTrack.java34 INITIALIZING, LIVE, ENDED, FAILED enum constant in enum:MediaStreamTrack.State
/external/chromium_org/ui/ozone/platform/dri/
H A Ddri_surface_factory.h41 FAILED, enumerator in enum:ui::DriSurfaceFactory::HardwareState
/external/qemu/distrib/sdl-1.2.15/src/audio/windx5/
H A Ddirectx.h33 #ifndef FAILED
34 #define FAILED(x) ((HRESULT)(x)<0) macro
/external/apache-http/src/org/apache/http/impl/auth/
H A DNTLMScheme.java59 FAILED, enum constant in enum:NTLMScheme.State
103 this.state = State.FAILED;
124 if (this.state == State.CHALLENGE_RECEIVED || this.state == State.FAILED) {
152 return this.state == State.MSG_TYPE3_GENERATED || this.state == State.FAILED;
/external/chromium_org/chrome/browser/printing/
H A Dprint_job.h150 // Is Canceling? If so, try to not cause recursion if on FAILED notification,
200 FAILED, enumerator in enum:printing::JobEventDetails::Type
/external/chromium_org/components/gcm_driver/android/java/src/org/chromium/components/gcm_driver/
H A DGCMDriver.java113 private enum UnregisterResult { SUCCESS, FAILED, PENDING } enum constant in enum:GCMDriver.UnregisterResult
123 return UnregisterResult.FAILED;
/external/chromium_org/components/precache/core/
H A Dprecache_fetcher_unittest.cc133 net::URLRequestStatus::FAILED); member in class:precache::__anon6770::net::URLRequestStatus
141 net::URLRequestStatus::FAILED); member in class:precache::__anon6770::net::URLRequestStatus
176 net::URLRequestStatus::FAILED); member in class:precache::__anon6770::net::URLRequestStatus
/external/chromium_org/components/signin/core/browser/
H A Dmutable_profile_oauth2_token_service_unittest.cc356 net::URLRequestStatus::FAILED); member in class:net::URLRequestStatus
/external/chromium_org/tools/auto_bisect/
H A Drequest_build.py45 FAILED = (FAILURE, EXCEPTION, SKIPPED) # These indicate build failure. variable
133 if (build_data.get('results') in FAILED and
235 A pair which consists of build status (SUCCESS, FAILED or PENDING) and a
256 return (FAILED, results_url)
/external/qemu/distrib/sdl-1.2.15/src/video/windx5/
H A Ddirectx.h33 #ifndef FAILED
34 #define FAILED(x) ((HRESULT)(x)<0) macro

Completed in 626 milliseconds

123