Searched refs:cout (Results 1 - 13 of 13) sorted by relevance

/frameworks/base/tools/aapt/tests/
H A DFileFinder_test.cpp18 using std::cout;
26 cout << "\n\n STARTING FILE FINDER TESTS" << endl;
51 cout << "Checking DirectoryWalker...";
53 cout << "PASSED" << endl;
56 cout << "Running findFiles()...";
59 cout << "PASSED" << endl;
63 cout << "Running size comparison: Size is " << testStorage.size() << ", ";
64 cout << "Expected " << SIZE_EXPECTED << "...";
66 cout << "PASSED" << endl;
68 cout << "FAILE
[all...]
H A DCrunchCache_test.cpp15 using std::cout;
19 cout << "Checking " << desc << ": ";
20 cout << "Got " << got << ", expected " << expected << "...";
21 cout << ( (got == expected) ? "PASSED" : "FAILED") << endl;
57 cout << "Running Crunch...";
59 cout << ((result > 0) ? "PASSED" : "FAILED") << endl;
65 cout << "Checking calls to deleteFile and processImage:" << endl;
79 cout << "ALL TESTS PASSED!" << endl;
81 cout << errno << " TESTS FAILED" << endl;
/frameworks/base/tools/aapt2/
H A DDebug.cpp38 std::cout << "(attr) type="; member in class:aapt::PrintVisitor::std
39 attr->printMask(&std::cout);
44 std::cout << "\n " << symbol.symbol.name.value().entry;
46 std::cout << " (" << symbol.symbol.id.value() << ")";
48 std::cout << " = " << symbol.value;
54 std::cout << "(style)"; member in class:aapt::PrintVisitor::std
57 std::cout << " parent="; member in class:aapt::PrintVisitor::std
60 std::cout << "*"; member in class:aapt::PrintVisitor::std
62 std::cout << parentRef.name.value() << " ";
66 std::cout << parentRe
71 std::cout << "\\n "; member in class:aapt::PrintVisitor::std
97 std::cout << "(styleable)"; member in class:aapt::PrintVisitor::std
99 std::cout << "\\n "; member in class:aapt::PrintVisitor::std
159 case SymbolState::kPublic: std::cout << " PUBLIC"; break; member in class:aapt::std
160 case SymbolState::kPrivate: std::cout << " _PRIVATE_"; break; member in class:aapt::std
217 std::cout << "digraph styles {\\n"; member in class:aapt::std
[all...]
/frameworks/native/libs/binder/tests/
H A DbinderThroughputTest.cpp137 cout << "average:" << average << "ms worst:" << worst << "ms best:" << best << "ms" << endl;
143 cout << "50%: " << cur_time << " ";
146 cout << "90%: " << cur_time << " ";
149 cout << "95%: " << cur_time << " ";
152 cout << "99%: " << cur_time << " ";
156 cout << endl;
186 cout << "Created BinderWorker" << num << endl;
209 cout << "thread " << num << " failed " << ret << "i : " << i << endl;
285 cout << "waiting for workers to complete" << endl;
293 cout << "iteration
[all...]
/frameworks/base/libs/hwui/tests/unit/
H A Dmain.cpp82 cout << endl << "Leaked memory!" << endl;
84 cout << "Re-run with 'setprop libc.debug.malloc.program hwui_unit_test'"
88 cout << merged.ToString(false);
115 cout << "Leak check took " << ns2ms(after - before) << "ms" << endl;
/frameworks/rs/api/
H A DGenerator.cpp196 cout << "Usage: gen_runtime spec_file [spec_file...] [-v version_of_test_files][-H]\n";
H A DSpecification.cpp369 cout << "Skipping some " << name << " definitions.\n";
395 cout << "Skipping some " << name << " definitions.\n";
612 cout << "Skipping some " << name << " definitions.\n";
938 cout << "Successfully processed " << mTypes.size() << " types, " << mConstants.size()
/frameworks/base/tools/aapt2/dump/
H A DDump.cpp42 std::cout << "Resource: " << file->name << "\n"
/frameworks/av/services/audioflinger/tests/
H A Dresampler_tests.cpp217 std::cout << out[i+passbandFrame*channels] << std::endl;
220 std::cout << out[i+stopbandFrame*channels] << std::endl;
/frameworks/base/tools/aapt2/java/
H A DJavaClassGenerator_test.cpp313 std::cout << actual << std::endl;
/frameworks/base/tools/aapt/
H A DCommand.cpp2731 std::cout << "Ready" << std::endl;
2742 std::cout << "Crunching " << inputFile << std::endl;
2744 std::cout << "Error" << std::endl;
2746 std::cout << "Done" << std::endl;
/frameworks/minikin/libs/minikin/
H A DLayout.cpp329 std::cout << glyph.glyph_id << ": " << glyph.x << ", " << glyph.y << std::endl;
/frameworks/compile/slang/
H A Dslang_rs_reflection.cpp637 std::cout << "Initializer which is non-NULL to pointer type variable " member in class:slang::std

Completed in 327 milliseconds